Home

Exit status 1 esp8266wifi.h: no such file or directory

You're trying to compile a program written for an ESP8266 for an Arduino UNO, that won't work. A Beginner's Guide to the ESP8266 Piete @Flylingi the problem has already been explained by facchinm.. This issue tracker is only to be used to report bugs or feature requests, not to ask for help with your project. The appropriate place to do that is the Arduino Forum exit status 1 ESP8266WiFi.h: No such file or directory This report would have more information with Show verbose output during compilation option enabled in File -> Preferences. ` — You are receiving this because you are subscribed to this thread

Error - ESP8266WiFi

fatal error: ESP8266HTTPClient.h: No such file or directory Hi.I have same probrem. Looks like you didn't select Generic ESP8266 WiFi board in the Arduino IDE compilation terminated. exit status 1 ESP8266WiFi.h: No such file or directory วิธีลง library 1.ดาวน์โหลดไฟล์ :link: Download ESP8266WiFi.h 2.แตกไฟล์ zip แล้วเอาไปวางใน C:\Users\ชื่อเครื่องคุณ\Documents\Arduino\l I want to turn my esp8266 into access point so that i would able to connect directly to it.i use the following sketch but when i select GENERIC module ESP8266 from menu the two libraries which is ESP8266WiFi.h and #include ESP8266WebServ..

i was trying to send some data to a webpage via esp8266wifi module connected to arduino uno. My sketch contains a header file .After searching online I could get the library Arduino-master.zip fro No need for any other IDE. So you've followed the setup guide, you've installed the esp8266 arduino core in the arduino IDE, you can see the esp8266 board support package in the arduino boards manager and it looks like this:. If so you should be able to open one of the available esp8266 example sketches from the File -> Examples -> Examples for generic esp8266 module section here

fatal error: ESP8266WiFi

help me! ESP8266_Standalone.ino:28:25: fatal error: ESP8266WIFI.h: No such file or directory compilation terminated Extend your platformio.ini file with one more library. Then it should work. lib_deps = ESP Async WebServer ESP8266WiF I want to turn my esp8266 into access point so that i would able to connect directly to it.i use the following sketch but when i select GENERIC module ESP8266 from menu the two libraries which is ESP8266WiFi.h and #include ESP8266WebServer.h become available but at this point i was unable to upload sketch to arduino.Also when i select Board as. Arduino Stack Exchange is a question and answer site for developers of open-source hardware and software that is compatible with Arduino. It only takes a minute to sign up. Sign up to join this community. Anybody can ask a question Anybody can answer The best answers are voted up and rise to the top Arduino . Home ; Questions ; Tags ; Users ; Unanswered ; RtcUtility.h: No such file or. I am trying to use the ESP8266WiFi library, but it is not found. Meanwhile I believe trough further reading that it might be included in PlatformIO. However when I try to compile my sample project I get an error: Comp

I have a problem ESP8266WiFi

  1. Arduino IDE Basics and Installing the RF24 Library for the NRF24L01 Radio Module - Duration: 8:21. RC Tractor Guy 21,041 view
  2. queue.h manquant (arduino ESP8266WiFi.h) × Après avoir cliqué sur Répondre vous serez invité à vous connecter pour que votre message soit publié. × Attention, ce sujet est très ancien
  3. Unzip the downloaded file; Browse through the unzipped folder until you find the library folder. This will either have a library.properties file and/or a .h file. Copy the library folder to {Sketchbook folder}/libraries. You can find the sketchbook folder in the Arduino IDE at File > Properties > Sketchbook location
  4. ated. exit status 1
  5. Stack Overflow for Teams is a private, secure spot for you and your coworkers to find and share information. Learn more . command 'x86_64-linux-gnu-gcc' failed with exit status 1. Ask Question Asked 3 years, 5 months ago. Active 4 months ago. Viewed 51k times 27. 11. I tried to install scholarly package, but I keep receiving this error: x86_64-linux-gnu-gcc -pthread -DNDEBUG -g -fwrapv -O2.

ESP8266WiFi.h: No such file or directory · Issue #42 ..

compilation terminated. exit status 1 ESP8266WiFi.h: No such file or directory วิธีลง library 1.ดาวน์โหลดไฟล์ Download ESP8266WiFi.h 2.แตกไฟล์ zip แล้วเอาไปวางใน C:\Users\ชื่อเครื่องคุณ\Documents\Arduino\librarie exit status 1 Erreur de compilation pour la carte NodeMCU 1.0 (ESP-12E Module) Note that I have the same Arduino 1.8.5 n another linux Fedora machine that works good and compile with no trouble

พึ่งจะเคยศึกษากับแอปBlynkครั้งแรกคับCodeมาจาก Exampleในไลบารี่คับ **Eror messages** Arduino: 1.8.5 (Windows 10), Board: NodeMCU 1.0 (ESP-12E Module), 80 MHz, 9600, 4M (3M SPIFFS) In file included from exit status 1 SSD1306.h: No such file or directory Michael Sharp exit status 1 SSD1306.h: No such file or directory Is there a way to find all libraries and other support files so that I can compile a custom version of Morserino? Thank you,-Michael. More. All Messages By This Member; Willi, OE1WKL #313 . Michael, How did you set up Arduino for the Heltec board? Did you use the libraries. ESP8266 Arduino library 를 추가한다. 자세한 설명은 아래 링크를 참고하시기 바랍니다. 단, 현재 진행중인 프로젝트(ASUL-E)에서는 아두이노 에서 별도의 tcp기반의 네트워크(wifi)를 사용하지 않기 때문에 여기에서는 해당 헤더를 코멘트 처리하였습니다 [已解决] No such file or directory 1:23: fatal error: PS2X_lib.h: No such file or directory #include <PS2X_lib.h> ^ compilation terminated. exit status 1 为开发板 Arduino/Genuino Uno 编译时出错。 回复. 举报. 奈何col. TA的每日心情. 郁闷 2018-12-6 22:21; 签到天数: 48 天 [LV.5]常住居民I. 发表于 2017-3-1 09:42 | 显示全部楼层. 提示你,没找到.

แก้ปัญหา ESP8266WiFi

ขึ้น exit status 1 DHT.h: No such file or directory ตอนอัพโหลดโปรแกรมคืออะไรหรอครับ QUOT This is a basic tutorial for arduino beginners, who often face this type of problem while uploading the code. More info - https://www.electronics.com.bd/blog.. Centos7 fatal error: Python.h: No such file or directory commmand 'gcc' failed with exit status 1 6944; Failed to connect to github-production-release-asset-2e65be.s3.amazonaws.com port 443: Timed out 5790; pandas保存csv文件:python to_csv permission denied 506 8.01x - Lect 24 - Rolling Motion, Gyroscopes, VERY NON-INTUITIVE - Duration: 49:13. Lectures by Walter Lewin. They will make you ♥ Physics. Recommended for yo

fatal error ESP8266WiFi

まぁ「No such file or directory」なんだからファイルが見つからないというのはわかるんですが・・・ 基準ディレクトリが何処で、一体どこを見にいっているのかさっぱりです。 当然のことながら、メインファイル側では #include <LiquidCrystal.h> とかはふつうに通ります。 これは標準のArduino ID i just have a OLED to display some messages, I used the these two libraries ADAFRUIT_SSD1306265 ADAFRUIT_SSD133113 however, both examples can't be compiled due to a problem saying: adafruit_gfx.cpp:34:39: fatal error: A Xiaoxu Meng. Welcome to blog of Xiaoxu Meng :) Please visit http://www.mengxiaoxu.com for more information. Thanks! Menu and widget

esp8266 - #include<ESP8266WiFi

  1. file_failure first argument is the boolean passed to set_exit_status Subcase A 2710 /* Read directory NAME, and list the files in it. 2711 If REALNAME is nonzero, print its name instead of NAME; 2712 this is used for symbolic links to directories. 2713 COMMAND_LINE_ARG means this directory was mentioned on the command line
  2. [Check-users] autom4te: cannot create autom4te.cache: No such file or directory
  3. - Mon Jan 07, 2019 3:59 am #79907 Include file missing for uint8_t etc, I think it is inttypes.h. But you can grep your include dir and see where it is defined and include the file
  4. ated. error: command 'x86_64-linux-gnu-gcc' failed.
  5. We use cookies for various purposes including analytics. By continuing to use Pastebin, you agree to our use of cookies as described in the Cookies Policy. OK, I Understan
  6. dl_lib.h: No such file or directory. 关于使用Arduino IDE对ESP32系列单片机进行编程时遇到dl_lib.h: No such file or directory的解决办法。 并不是什么技术含量很高的东西,但是碰到这种情况会很烦。最近在研究ESP32-CAM就遇到这个问题了,研究了好久,好像还没什么人说过这个.
  7. This is now a python3 bug. Also, it's notabug I guess because once /usr/bin/python3.7 is in the buildroot, it works like this: 0:10:22 load avg: 0.94 [111/415] test_distutils find: 'debug': No such file or directory /sbin/ldconfig: Warning: ignoring configuration file that cannot be opened: /etc/ld.so.conf: No such file or directory find: 'debug': No such file or directory /sbin.

Several applications give libtasn1.so.3: cannot open shared object file: No such file or directory 3 'libstdc++.so.6: cannot open shared object file: No such file or directory module 'torchvision.datasets' has no attribute 'VOCDetection' MaskrcnnBenchmark 源码解析-模型定义(modeling)之骨架网络(backbone) 安装 maskrcnn-benchmark 报错command 'gcc' failed with exit status 1 ; 用Numpy实现一个简单的神经网 cuda程序执行出错: libcudart.so.8.0: cannot open shared object file: No such file or directory 05-06 4万+ nvcc -V 显示信息与安装的 CUDA 版本不一致 问题 解决 方 在生成均值文件之后,开始train,发现出现了这个问题。1,路径正确,却读不到图片。[db_lmdb.hpp:15] Check failed: mdb_status == 0 (2 vs. 0) No such file or directory 我发现这check failed的上面有一句话:就是lo..

Loading problem library · Issue #2993 · esp8266/Arduino

Re: fatal error: SoftwareSerial.h: No such file or directory by adafruit_support_mike on Tue Jan 26, 2016 1:50 am It sounds like you didn't put the folder containing the GPS library in your sketchbook/libraries folder, or the Arduino IDE can't see it for some reason This article looked at the No such file or directory message of the GCC C++ compiler. If you get this message you should: Remember that the compiler is always right in situations like this. Look very closely at the file name to make sure it is correct. Avoid naming file using mixed-case or special characters fatal error: wiring.h: No such file or directory,出了这个问题怎么办 [复制链接] 杰梗. TA的每日心情. 慵懒 2015-8-18 20:58; 签到天数: 21 天 [LV.4]偶尔看看III. 发表于 2015-3-12 18:06 | 显示全部楼层 | 阅读模式. 回复. 举报. tsaiwn. TA的每日心情. 郁闷 2019-2-20 14:52; 签到天数: 172 天 [LV.7]常住居民III. 发表于 2015-3-12 23:03. unable to execute gcc: No such file or directory. error: command 'gcc' failed with exit status. 1 解决: yum -y install gcc. 2、缺少python-dev依赖环境 . 报错提示: psutil/_psutil_linux.c:12:20: fatal error: Python.h: No such file or directory . #include <Python.h> ^ compilation terminated. error: command 'gcc' failed with exit status 1. 解决: yum -y install python-devel.x86.

See `systemctl status systemd-random-seed.service` for details. [FAILED] Failed to start Various fixups to make systemd work better on Debian. See `systemctl status debian-fixup.service` for details I am trying to install cocoapi but I do not have Python.h. I read that I need to install python-dev but I do not have sudo. Are there any other easy ways to get Python.h? Will I get Python.h if i i.. gnutls.h: No such file or directory 的解决方案 In file included from src/docstrings.c:4:0: src/pycurl.h:148:30: fatal error: gnutls/gnutls.h: No such file or directory # include <gnutls/gnutls.h> ^ compilation terminated

apt upgrade: Failed to execute operation: No such file or directory. Ask Question Asked 2 years, 6 months ago. Active 2 years, 6 months ago. Viewed 2k times 1. After upgrading from 14.04 to 16.04 apt-get got somehow messed up on my xenial system and I'm not sure how to fix it. This what I get (after apt update). Can anyone offer some advice on how to fix this? $ sudo apt upgrade Reading. Unix & Linux Stack Exchange is a question and answer site for users of Linux, FreeBSD and other Un*x-like operating systems. It only takes a minute to sign up. Sign up to join this community. Anybody can ask a question Anybody can answer The best answers are voted up and rise to the top Home ; Questions ; Tags ; Users ; Unanswered #!/bin/bash - no such file or directory. Ask Question Asked 8.

Die Suche über Google ergibt Treffer zu Linux. Mit diesem bin ich nicht vertraut. Dann wird mir wohl kaum etwas anderes übrig bleiben als unter Windows 7 und einem kleineren Display weiterzumachen. THNX und Gruß aus JO53EF 18.01.2016, 17:43 . Beitrag #6. hotsystems Posting Freak: Beiträge: 6.420 Registriert seit: Jun 2015 RE: exit status 1 - Fehler beim kompilieren (18.01.2016 17:29. fatal error: WProgram.h: No such file or directory #include WProgram.h EDIT - Problem Solved: Turns out there was actually two copies of the library - one which sketches use and another that the example file which I was trying to compile uses

[Solved] ESP8266 WiFI

src/MD2.c:31:20: fatal error: Python.h: No such file or directory. compilation terminated. error: command 'gcc' failed with exit status 1. Where can I find Python.h file and how do I fix this problem under Debian or Ubuntu Linux sever based system? Python.h is nothing but a header file. It is used by gcc to build applications. You need to. In file included from Modules/LDAPObject.c:8:0: Modules/constants.h:7:18: fatal error: lber.h: No such file or directory #include lber.h ^ compilation terminated. error: command 'gcc' failed with exit status 1 . yum install python-devel yum install openldap-deve

Fatal error: ESP8266WiFi

I download the latest stable version of psensor: psensor-1.0.4. I try to install it from source on Ubuntu 12.04. ./configure generates a Makefile, But when I run make, psensor.h:22:29: fatal error: sensors/sensors.h: No such file or directory I searched and found that it was with lm_sensors-devel which I haven't installed Hi everybody, i have some trouble to upload the code to openBCI board. I have follow closely the guide Unable to execute gcc: No such file or directory Error: command 'gcc' failed with exit status 1 I'm installing pip within a virtualenv. I tried to install build essentials with the following command but I still get the same error: apt-get -y install build-essential Can anyone help me understand where I have gone wrong please

esp8266 - RtcUtility

ESP8266WiFi library not found - PlatformIO Communit

  1. The build process is building the fontconvert directory and should not (according to Arduino IDE 1.5: Library specification). I think this behavior has changed from earlier PlatformIO versions. My understanding from the Arduino spec is that if a library puts its source files in the root directory, then it does not recurse into child directories
  2. unable to execute 'gcc': No such file or directory error: command 'gcc' failed with exit status 1 Install gcc for compiling C code sudo yum install gcc Note however that it is not recommended to run this on proaction systems. Only run on development systems where code needs to be compiled and on the systems that are used to build and deploy.
  3. 1 day ago Mr Scott is a best hacker Hit up Scott James is a reliable person who I trust for all hacking professionals and it a God fearing person hit him up on his WhatsApp number +1615442640

About us. We are a strong Community of developers, hackers, and visionaries. No, seriously, we are Getting EXIT STATUS 8508: List of trusted Certificate Authorities could not be fetched after upgrading to NetBackup 8.0 on VCS Clustered Master Server on UNIX. Article: 100039656 Last Published: 2018-01-0 Linux Shell Script Error: No such file or directory User Name: Remember Me? Password : Programming This forum is for all programming questions. The question does not have to be directly related to Linux and any language is fair game. Notices: Welcome to LinuxQuestions.org, a friendly and active Linux Community. You are currently viewing LQ as a guest. By joining our community you will have the. Install these psycopg2 dependencies on Ubuntu before pip install psycopg2 to fix below error: In file included from psycopg/psycopgmodule.c:27:0: ./psycopg/psycopg.h:30:20: fatal error: Python.h: No such file or directory compilation terminated. error: command 'gcc' failed with exit status 1 - psycopg2_install_dependencies.s There are three cases where you can get the message No such file or directory: The file doesn't exist. I presume you've checked that the file does exist (perhaps because the shell completes it)

fatal error No such file or directory - YouTub

snappy/snappymodule.cc:31:22: fatal error: snappy-c.h: No such file or directory #include <snappy-c.h> ^ compilation terminated. error: command 'gcc' failed with exit status 1 . Any advice would be appreciated. Answer. Watch. Like Be the first to like this . 1 answer 0 votes . lassian Atlassian Team Jul 23, 2018. Hi Muhammed, It appears that in each step you are setting up parts of the. Dev-c++怎么解决reg52.h: No such file or directory compilation terminated. 我来答 . 2个回答 #热议# 选择一份工作你会优先考虑薪资吗? 墨汁诺 2019-11-17 墨汁诺 采纳数: 10 获赞数: 269600 LV5 擅长: 暂未定制 参与团队: 中程数据科技 向TA提问 私信TA. 展开全部. 这句话的意思就 是程 2113 序中 引入 了某个文 件不. PIC32 Example 1.c:1:27: fatal error: p32mx795f512l.h: No such file or directory compilation terminated. I have made sure to add this header file to the project, and have tried adding it using the Auto option (where MPLAB decides whether to use a relative or absolute path to the file) as well as the Copy option (where the header file is copied to the project directory)

queue.h manquant (arduino ESP8266WiFi.h) par ..

QT4.8编译时出现:-1: 错误:CreateProcess: No such file or directory,是怎么回事?如何处理? [问题点数:100分] 收藏帖子; 回复; ⋅QT4.8编译时出现:-1: 错误:CreateProcess: No such file or directory,是怎么回事?如何处理? 更多帖子 关注 私信 空间 博客. u012940119. 本版专家分:0. 结帖率 0% 0 2013-11-24 15:35:03. 回复数 7 只看. Not having the m4 directory in git is solvable - merely do: printf '*\n!.gitignore' > m4/.gitignore then check in that file. I seriously doubt you ship your tarball with no m4 directory, since the tarball is intended to work without people having to rerun automake or libtool, so the m4 directory in the tarball would already be populated. So. Make WiFi Jammer With ESP8266 - Hack Any WiFi Without Password!: Hey friends, Its Kedar Here, Have you ever wanted to block all wifi signals. or just want to kick someone out from wifi or a neighbors wifi. Well this is it guys your wait is over. Here is the $8 DIY Wifi Jammer to try for yourself.To see how effe.. cannot open: No such file or directory 而且看这个目录里面,也一直只有这个压缩文件,没有解压出的任何东东,这就奇怪了,我究竟错在哪里了? 该怎么解决这个问题呢? PS:我在别的机器上正确解压过这个文件,因此这个压缩文件肯定是对的~ 0 2005-07-20 16:34:49. 回复数 5 只看楼主 引用 举报 楼主. ⋅还差30. ESP8266WiFi library In the first line of the sketch, #include <ESP8266WiFi.h> we are including the ESP8266WiFi library. This library provides ESP8266 specific Wi-Fi routines that we are calling to connect to the network. The actual connection to Wi-Fi is initialized by calling: WiFi. begin (network-name, pass-to-network); The connection process can take couple of seconds and we are.

1 异常信息 解决方案 没有安装python3-devel包 导致报错yum -y install python3-deve Oracle Applications DBA - Version 12.1.1 to 12.1.1 [Release 12.1]: AD Relink Errors - stddef.h: No such file or directory ; libnnz11.so: could not read symbols: I Raspberry Pi Stack Exchange is a question and answer site for users and developers of hardware and software for Raspberry Pi. It only takes a minute to sign up. Sign up to join this community. Anybody can ask a question Anybody can answer The best answers are voted up and rise to the top Home ; Questions ; Tags ; Users ; Unanswered ; wiringPi.h: No such file or directory #include < wiringPi.h. GCC Bugzilla - Bug 40433 /usr/bin/ld: cannot open crti.o: No such file or directory Last modified: 2009-06-13 01:55:14 UTC. Home | New | Browse | Search | | Reports | Help | New Account | Log In. Remember | Forgot Password. Login: Bug 40433 - /usr/bin/ld: cannot open crti.o: No such file or directory. Summary: /usr/bin/ld: cannot open crti.o: No such file or directory Status: RESOLVED. windwos.h:No such file or directory解决办法. 笔者在qt项目中遇到编译错误windwos.h:No such file or directory,通过百度,谷歌啊,碰上一大堆明白人瞎指挥,什么重装VS2013,什么重装QT,白白浪费了我时间

All content and materials on this site are provided as is. TI and its respective suppliers and providers of content make no representations about the suitability of these materials for any purpose and disclaim all warranties and conditions with regard to these materials, including but not limited to all implied warranties and conditions of merchantability, fitness for a particular purpose. Alex Sleat — How To Fix: fatal error: Python.h: No such file or directory Cancel [] Jacopo. October 7, 2011 at 1:57 pm. Thanks a lot, this solved my trouble! Opocaj. October 17, 2011 at 8:34 pm. Thanks! I used python2.7-dev and it worked great. best linux os. December 8, 2011 at 4:27 pm. Hi there, You've performed a great job. I'll certainly digg it and for my part recommend to my.

在C++中#include<function.h>出现了 no such file or directory compilation terminated. 我来答 . 2个回答 #热议# 父母偏心到底有多伤人? ice2921 推荐于2018-03-01 ice2921 采纳数: 1750 获赞数: 5534 LV13 擅长:社会民生 教育/科学 文化/艺术 资源共享 编程语言 向TA提问 私信TA. 展开全部. 这个头文件是自己写的吧,需要指定其. cairo/device.c:30:10: fatal error: Python.h: No such file or directory #include <Python.h> Proposed solution: Make sure that you have installed Python development packages for your operating system. But when I run sudo apt-get install python-dev python-pip in Terminal (on Ubuntu 18.04.3 LTS) I get this 'no problem'-message unable to execute gcc: No such file or directory User Name: Remember Me? Password: Linux - Kernel This forum is for all discussion relating to the Linux kernel. Notices: Welcome to LinuxQuestions.org, a friendly and active Linux Community. You are currently viewing LQ as a guest. By joining our community you will have the ability to post topics, receive our newsletter, use the advanced search. bash: /usr/bin/sp-sc-auth: No such file or directory. But the file ist there... [shibby@linux bin]$ ls -d sp* sp-sc-auth spd-conf spd-say spdsend speaker-test speech-dispatcher speexdec speexenc split sprof . What is wrong? FYI [shibby@linux bin]$ uname -r 3.4.9-1-ARCH. Thanks shibby. Last edited by shibby (2012-08-27 14:59:51) Offline #2 2012-08-27 14:08:52. karol Archivist Registered: 2009.

error: command 'c1.exe' failed: No such file or directory _mysql.c error: command 'C:\Program Files (x86)\Microsoft Visual Studio 14.0\VC\bin\x86_amd64\c1.exe' failed with exit status 2 No such file or directory #include <openssl/opensslv.h> error: command 'gcc' failed with exit status 1 Once again run the yum list command to find the correct library. In this case the name is not quite so apparent. I found a number of libraries using this command: sudo yum list | grep openssl Such as the following: openssl.x86_64 1:1..1k-15.99.amzn1 installed apr-util-openssl.x86_64 1.4. hi i am getting followingf error i tried everything but still getting this error i removed esp8266 from board manager and reinstall 2.4.1 version but still getting erro

ArduinoJson.h: No such file or directory - Stack Overflo

用gcc编译c程序出现 fatal error: graphics.h: No such file or directory compilation terminated. 5. 我来答 . 1个回答 #热议# 选择一份工作你会优先考虑薪资吗? shiny_chinese 推荐于2018-02-27 shiny_chinese 采纳数: 64 获赞数: 318 LV6 擅长:C/C++ 汇编语言 嵌入式 Linux 向TA提问 私信TA. 展开全部. graphics.h is including a c++ header sstream. Feb 11 20:55:02 Singapore-ap-southeast systemd[1]: nginx.service: PID 20404 read from file /run/nginx.pid does not exist or is a zombie. Feb 11 20:55:02 Singapore-ap-southeast systemd[1]: Started A high performance web server and a reverse proxy server. What does sudo systemctl status nginx return? Is it running or not Wait helm template failed. Error: stat /cert-manager: no such file or directory : exit status 1 - 单机安装rancher 没有helm命令使用 其他商城就提示 Wait helm template failed. Error: stat /cert-manager: no such file or directory :. But packages should not depend on targeted policy. Directory /etc/selinux/targeted does not exist in that case and such case is not handled well by %selinux_set_booleans macro. More about it is on bug #1631814. It would behave the same way also in docker image without selinux policy. I think we want such case supported palindrome.c:2:21: fatal error: reverse.h: No such file or directory compilation terminated. The file reverse.h indeed is in the directory because i copied everything from lab2 directory to lab 3. So why is it saying that? Thanks for the hel

Yes, I did it. This Problem occurred when I wanted to install Logsatsh with deb file yep. That #include is in a file called simplemenu.h. Then a file called main.cpp has #include simplemenu.h fatal error: iostream: No such file or directory. raysonkong My first program won't run. it says fatal error: iostream: No such file or directory. > it says fatal error: iostream: No such file or directory. Use the C++ compiler. For instance, g++ and not gcc. From the command line, something like: > g++ -std=c++11 -Wall -Wextra -pedantic-errors -o my_program.exe my_program.cc : Yanson. I was installing OpenStack Swift 1.11.0 which depends on cffi 0.8.1. The OS is Ubuntu 12.04.3 LTS 3.2.-54-virtual x86_64. For me, sudo apt-get install libffi-dev solved the dependency problem of cffi OK, it turns out that the failed installer did install it, but it still crashes, same as before: 2011/05/16 22:27:29.785 7:58.436 Housekeeper:0xb6b7cb70 OpalUDP Setting interface to 192.168.168.1%vmnet8 2011/05/16 22:27:29.786 7:58.436 Housekeeper:0xb6b7cb70 SIP Transaction timers set: retry=0.500, completion=6.000 2011/05/16 22:27:29.787 7:58.437 Housekeeper:0xb6b7cb70 SIP SUBSCRIBE.

  • Avantage travail en usine.
  • Projecteur piscine compatible desjoyaux.
  • Kuroko no basket last game amv.
  • Sujet capet 2017.
  • Casque soldat de la grande guerre.
  • Freenom.
  • Ile de l'ascension photos.
  • Cannondale kinneto rigid 2016.
  • Jeux bayésien.
  • Travail créatif.
  • Lecture documentaire les instruments de musique.
  • Disjoncteur non différentiel enedis.
  • Magasin zurich aeroport.
  • Activité mentale mots fléchés.
  • Pourquoi ma montre connectée se deconnecte.
  • Synonyme de aguiche a la tele.
  • Apprendre le polonais en ligne.
  • Terrain non constructible a vendre 94.
  • Cours de droit du commerce international.
  • Exemple d'incitation.
  • Programme fessier intensif femme.
  • Gros chaudron cuivre.
  • Byōsoku go senchimētoru vostfr.
  • Ligne bus toulouse.
  • Vapormax flyknit noir femme.
  • Définition de paternel.
  • Sentiment de marginalisation.
  • Fete du mouton 2019 cameroun.
  • Deguisement harry potter.
  • Comment appeler son journal intime.
  • Blogueuse mode asiatique.
  • Un homme doux definition.
  • Pepehousing wroclaw.
  • Championnat algérien division 1.
  • Virginie despentes vernon.
  • Quiz rainbow six siege 2019.
  • Katniss everdeen costume.
  • Monsieur le capitaine de vaisseau.
  • Comment obtenir la carte famille militaire sncf.
  • Starbucks uk prices 2019.
  • Article l3133 4 du code du travail.